A subject domain, e.g. birds or bibles.
type: Class

Has desciptive image
type: Property
comment: Property connecting a resource to an image descibing the resource
sub property of: description
range: Descriptive image

Descriptive image
type: Class
comment: Image that illustrates a resource
subclass of: StillImage

Has target class
type: Property
comment: The class that is targeted for annotation.

Has user interface specification
type: Property
comment: Property linking a domain to a user interface specification.
range: UI
domain: A subject domain, e.g. birds or bibles.

Has domain label
type: Property
comment: Property linking a domain to a label.

Has annotation interface specification
type: Property
comment: Property linking a domain to an annotation interface specification.

Top concept
type: Property
comment: The concept from which the taxonomy is decended to get expertise topics.

Has maximum number of expertise topics
type: Property
comment: The maximum number of expertise topics shown to a user.

Example query
type: Class
comment: Query illustrating the domain

Action
type: Property
comment: The action taken upon interacting with element

Has maximum number of children
type: Property
comment: The number of child concepts shown in expertise screen

Has file path
type: Property
comment: Connecting a resource to the filepath it can be found

Has brightness
type: Property
comment: Whether a depiction is dark or light.