Super-class of all Accurator user interfaces
type: Class

Accurator annotation interface
type: Class
subclass of: Super-class of all Accurator user interfaces

Super-property of all labels
type: Property

Property connecting UI to text
type: Property
sub property of: Super-property of all labels

Property connecting UI to label for button
type: Property
sub property of: Super-property of all labels

Property connecting UI to label for link
type: Property
sub property of: Super-property of all labels

Super-class of all labels
type: Class

Super-class of all fields
type: Class

Fields for UI
type: Property
comment: Property for connecting annotation UI to included fields

Fields for fragments
type: Property
sub property of: Fields for UI
comment: Property for connecting fields for describing fragments of media.

Fields for describing whole things
type: Property
sub property of: Fields for UI
comment: Property for connecting annotation UI to include fields that describe whole things.

Dropdown
type: Class
subclass of: Super-class of all fields

Text field
type: Class
subclass of: Super-class of all fields

Radio buttons
type: Class
subclass of: Super-class of all fields

Checkboxes
type: Class
subclass of: Super-class of all fields

Select field
type: Class
comment: Selectfield bundles possible options together.

Has select field
type: Property
subclass of: Super-class of all fields
comment: Property linking a ui and a select field

Option of selector field
type: Class
comment: Option of a selectfield with a preflabel and notation, used for language independent storage of selected values.

Has select option
type: Property
comment: Property linking a selectfield and its options.

Source of annotation alternatives
type: Class
comment: Source of annotation alternatives, e.g. dropdown alternatives.

Has source
type: Property
comment: The source of data for an input field.