Ontology
version info: $Id: align.owl 334 2006-10-05 08:55:22Z euzenat $
comment: Ontology for Ontology alignments

onto1
type: DatatypeProperty
comment: This string is the URl at whitch the ontology can be fetched
domain: Alignment
range: string

onto2
type: DatatypeProperty
comment: This string is the URl at whitch the ontology can be fetched
domain: Alignment
range: string

type
type: DatatypeProperty
comment: This is indeed a 2 letter string on the alphabet 1 ? + *
domain: Alignment
range: string

relation
type: DatatypeProperty
comment: This is currently a string but should be upgraded soon
domain: Cell
range: string

Alignment
type: Class
subclass of: Restriction
  on property: xml
  cardinality: 1
subclass of: Restriction
  on property: onto1
  cardinality: 1
subclass of: Restriction
  on property: onto2
  cardinality: 1
subclass of: Restriction
  on property: type
  cardinality: 1
subclass of: Restriction
  on property: map
  all values from: Cell

Cell
type: Class
subclass of: Restriction
  on property: entity1
  cardinality: 1
subclass of: Restriction
  on property: entity2
  cardinality: 1
subclass of: Restriction
  on property: measure
  cardinality: 1
subclass of: Restriction
  on property: relation
  cardinality: 1

OWLEntity
type: Class
comment: This is a place holder for the real OWL entity which bears the same URI